The SuperCon Ontology, Schema
type: Ontology
creator: Masashi Ishii
description: The SuperCon ontology that provides the vocabulary needed to describe superconductor data in RDF.
license: Creative Commons Attribution 4.0 International
comment: The SuperCon Ontology, Schema
label: SuperCon-Ontology_Schema
version info: 1.1

hasInformation
type: ObjectProperty
inverse of: IAO_0000136
domain: BFO_0000001
range: IAO_0000030

hasAttribute
type: ObjectProperty
sub property of: hasInformation

hasFigureData
type: ObjectProperty
sub property of: hasAttribute
domain: Specimen
range: FigureNumber

hasDescriptor
type: ObjectProperty
sub property of: hasAttribute
domain: Specimen
range: Descriptor

isCharacterizedBy
type: ObjectProperty
comment: The relationship A isCharacterizedBy B represents a relationship in which the important characteristics of A are determined by an entity B that is different from A.

hasCondition
type: ObjectProperty
sub property of: isCharacterizedBy
domain: OBI_0000011

hasMolecularFormula
type: ObjectProperty
sub property of: hasDescriptor
domain: Specimen
range: element

ParallelTo
type: ObjectProperty
sub property of: hasDescriptor
domain: Physical Descriptor
range: CrystalOrientation

PerpendicularTo
type: ObjectProperty
sub property of: hasDescriptor
domain: Physical Descriptor
range: CrystalOrientation

isPotentiallyRelatedTo
type: ObjectProperty
comment: isPotentiallyRelatedTo refers to the fact that two entities are potentially related, and represents a relationship that is not directly related but can be referred to

dependentsOn
type: ObjectProperty
sub property of: isPotentiallyRelatedTo
domain: isotope
range: OxideAndMetallic

hasIsotope
type: ObjectProperty
sub property of: topObjectProperty
domain: OxideAndMetallic
domain: Organic
range: isoel

realizes
type: ObjectProperty
sub property of: topObjectProperty
domain: Specimen
range: Component
comment: Realizes the entity indicated by the object; unlike BFO:0000055 (realize), the subject need not be a process.

Property
type: Class
subclass of: BFO_0000020
comment: Property refers to properties on SuperCon.

Relational Property
type: Class
subclass of: Property
comment: A subclass of the Property Class, RelationalProperty. Properties that presuppose the existence of a substance that has properties and the existence of other substances

isotope
type: Class
subclass of: Relational Property
comment: A subclass of the RelationalProperty Class, isotope. alpha in Tc = A * M^(-alpha), isotope effect

Material Property
type: Class
subclass of: Property
comment: A subclass of the Property Class, MaterialProperty

oz
type: Class
subclass of: Material Property
comment: A subclass of the MaterialProperty Class, oz. measured value of Oxygen content

Magnetic property
type: Class
subclass of: Property
comment: A subclass of the Property Class, MagneticProperty

kaizero
type: Class
subclass of: Magnetic property
comment: A subclass of the MagneticProperty Class, kaizero. temperature independent term in susceptibility

curiec
type: Class
subclass of: Magnetic property
comment: A subclass of the MagneticProperty Class, curiec. Curie constant

moment
type: Class
subclass of: Magnetic property
comment: A subclass of the MagneticProperty Class, moment. magnetic moment per formula

curiet
type: Class
subclass of: Magnetic property
comment: A subclass of the MagneticProperty Class, curiet. Curie temperature

neelt
type: Class
subclass of: Magnetic property
comment: A subclass of the MagneticProperty Class, neelt. Neel temperature

Mechanical property
type: Class
subclass of: Property
comment: A subclass of the Property Class, MechanicalProperty

dens
type: Class
subclass of: Mechanical property
comment: A subclass of the MechanicalProperty Class, dens. density (gcm-3)

hv300
type: Class
subclass of: Mechanical property
comment: A subclass of the MechanicalProperty Class, hv300. hardness at 300 K

yehe
type: Class
subclass of: Mechanical property
comment: A subclass of the MechanicalProperty Class, yehe. Young's modulus at 4.2 K

ye300
type: Class
subclass of: Mechanical property
comment: A subclass of the MechanicalProperty Class, ye300. Young's modulus at 300 K

ghe
type: Class
subclass of: Mechanical property
comment: A subclass of the MechanicalProperty Class, ghe. shear modulus at 4.2 K

g300
type: Class
subclass of: Mechanical property
comment: A subclass of the MechanicalProperty Class, g300. shear modulus at 300 K

bhe
type: Class
subclass of: Mechanical property
comment: A subclass of the MechanicalProperty Class, bhe. bulk modulus at 4.2 K

b300
type: Class
subclass of: Mechanical property
comment: A subclass of the MechanicalProperty Class, b300. bulk modulus at 300 K

pohe
type: Class
subclass of: Mechanical property
comment: A subclass of the MechanicalProperty Class, pohe. Poisson ratio at 4.2 K

po300
type: Class
subclass of: Mechanical property
comment: A subclass of the MechanicalProperty Class, po300. Poisson ratio at 300 K

svhe
type: Class
subclass of: Mechanical property
comment: A subclass of the MechanicalProperty Class, svhe. sound velocity at 4.2 K

sv300
type: Class
subclass of: Mechanical property
comment: A subclass of the MechanicalProperty Class, sv300. sound velocity at 300 K

Structural property
type: Class
subclass of: Property
comment: A subclass of the Property Class, StructuralProperty

LatticeConstant
type: Class
subclass of: Structural property
comment: A subclass of the StructuralProperty Class, LatticeConstant

lata
type: Class
subclass of: LatticeConstant
comment: A subclass of the LatticeConstant Class, lata. lattice constant a

latb
type: Class
subclass of: LatticeConstant
comment: A subclass of the LatticeConstant Class, latb. lattice constant b

latc
type: Class
subclass of: LatticeConstant
comment: A subclass of the LatticeConstant Class, latc. lattice constant c

dadt
type: Class
subclass of: Structural property
comment: A subclass of the StructuralProperty Class, dadt. temperature dependence of lata

dbdt
type: Class
subclass of: Structural property
comment: A subclass of the StructuralProperty Class, dbdt. temperature dependence of latb

dcdt
type: Class
subclass of: Structural property
comment: A subclass of the StructuralProperty Class, dcdt. temperature dependence of latc

dadp
type: Class
subclass of: Structural property
comment: A subclass of the StructuralProperty Class, dadp. pressure dependence of lata

dbdp
type: Class
subclass of: Structural property
comment: A subclass of the StructuralProperty Class, dbdp. pressure dependence of latb

dcdp
type: Class
subclass of: Structural property
comment: A subclass of the StructuralProperty Class, dcdp. pressure dependence of latc

Superconducting property
type: Class
subclass of: Property
comment: A subclass of the Property Class, SuperConductingProperty

t1
type: Class
subclass of: Superconducting property
comment: A subclass of the SuperConductingProperty Class, t1. transition temperature (R = 0)

t2
type: Class
subclass of: Superconducting property
comment: A subclass of the SuperConductingProperty Class, t2. transition temperature (mid point)

t3
type: Class
subclass of: Superconducting property
comment: A subclass of the SuperConductingProperty Class, t3. transition temperature (R = 100%)

tcsus
type: Class
subclass of: Superconducting property
comment: A subclass of the SuperConductingProperty Class, tcsus. Tc from susceptibility measurement

tcn
type: Class
subclass of: Superconducting property
comment: A subclass of the SuperConductingProperty Class, tcn. lowest temperature for measurement (not superconducting)

tcwidth
type: Class
subclass of: Superconducting property
comment: A subclass of the SuperConductingProperty Class, tcwidth. transition width for resistive transition

tc
type: Class
subclass of: Superconducting property
comment: A subclass of the SuperConductingProperty Class, tc. Tc (of this sample) recommended

dtcdp
type: Class
subclass of: Superconducting property
comment: A subclass of the SuperConductingProperty Class, dtcdp. slope at P = 0 in Tc vs P plot

pmax
type: Class
subclass of: Superconducting property
comment: A subclass of the SuperConductingProperty Class, pmax. maximum pressure applied

dtc
type: Class
subclass of: Superconducting property
comment: A subclass of the SuperConductingProperty Class, dtc. DTC = Tc - Tc0 for isotope element

vols
type: Class
subclass of: Superconducting property
comment: A subclass of the SuperConductingProperty Class, vols. volume fraction of Meissner effect(%)

hc1zero
type: Class
subclass of: Superconducting property
comment: A subclass of the SuperConductingProperty Class, hc1zero. Hc1 at 0 K for poly crystal

phc1zero
type: Class
subclass of: Superconducting property
comment: A subclass of the SuperConductingProperty Class, phc1zero. Hc1 at 0 K for single crystal for H //ab-plane

nhc1zero
type: Class
subclass of: Superconducting property
comment: A subclass of the SuperConductingProperty Class, nhc1zero. Hc1 at 0 K for single crystal for H //c-axis

hc1t
type: Class
subclass of: Superconducting property
comment: A subclass of the SuperConductingProperty Class, hc1t. Hc1 at given temperature for poly crystal

phc1t
type: Class
subclass of: Superconducting property
comment: A subclass of the SuperConductingProperty Class, phc1t. Hc1 at given temperature for single crystal H//ab-plane

nhc1t
type: Class
subclass of: Superconducting property
comment: A subclass of the SuperConductingProperty Class, nhc1t. Hc1 at given temperature for single crystal H//c-axis

hc2zero
type: Class
subclass of: Superconducting property
comment: A subclass of the SuperConductingProperty Class, hc2zero. Hc2 at 0 K for poly crystal

phc2zero
type: Class
subclass of: Superconducting property
comment: A subclass of the SuperConductingProperty Class, phc2zero. Hc2 at 0 K for single crystal for H //ab-plane

nhc2zero
type: Class
subclass of: Superconducting property
comment: A subclass of the SuperConductingProperty Class, nhc2zero. Hc2 at 0 K for single crystal for H //c-axis

hc2t
type: Class
subclass of: Superconducting property
comment: A subclass of the SuperConductingProperty Class, hc2t. Hc2 at given temperature for poly crystal

phc2t
type: Class
subclass of: Superconducting property
comment: A subclass of the SuperConductingProperty Class, phc2t. Hc2 at given temperature for single crystal H//ab-plane

nhc2t
type: Class
subclass of: Superconducting property
comment: A subclass of the SuperConductingProperty Class, nhc2t. Hc2 at given temperature for single crystal H//c-axis

dhc2dt
type: Class
subclass of: Superconducting property
comment: A subclass of the SuperConductingProperty Class, dhc2dt. -slope in Hc2 vs T at Tc for poly crystal

pdhc2dt
type: Class
subclass of: Superconducting property
comment: A subclass of the SuperConductingProperty Class, pdhc2dt. -slope in Hc2 vs T at Tc for single crystal for H //ab-plane

ndhc2dt
type: Class
subclass of: Superconducting property
comment: A subclass of the SuperConductingProperty Class, ndhc2dt. -slope in Hc2 vs T at Tc for single crystal for H //c-axis

cohere
type: Class
subclass of: Superconducting property
comment: A subclass of the SuperConductingProperty Class, cohere. coherence length at 0 K for poly crystal

pcohere
type: Class
subclass of: Superconducting property
comment: A subclass of the SuperConductingProperty Class, pcohere. coherence length at 0 K for single crystal for H //ab-plane

ncohere
type: Class
subclass of: Superconducting property
comment: A subclass of the SuperConductingProperty Class, ncohere. coherence length at 0 K for single crystal for H ⊥ab-plane

penet
type: Class
subclass of: Superconducting property
comment: A subclass of the SuperConductingProperty Class, penet. penetration depth at 0 K for poly crystal

ppenet
type: Class
subclass of: Superconducting property
comment: A subclass of the SuperConductingProperty Class, ppenet. penetration depth at 0 K for single crystal for H //ab-plane

npenet
type: Class
subclass of: Superconducting property
comment: A subclass of the SuperConductingProperty Class, npenet. penetration depth at 0 K for single crystal for H⊥ab-plane

gap
type: Class
subclass of: Superconducting property
comment: A subclass of the SuperConductingProperty Class, gap. energy gap at 0 K , delta(0)

gapene
type: Class
subclass of: Superconducting property
comment: A subclass of the SuperConductingProperty Class, gapene. normarized energy gap at 0 K , 2delta(0)/kTc

jche
type: Class
subclass of: Superconducting property
comment: A subclass of the SuperConductingProperty Class, jche. Jc at 4.2 K, H = 0 T

jc77
type: Class
subclass of: Superconducting property
comment: A subclass of the SuperConductingProperty Class, jc77. Jc at T = 77 K, H = 0 T

Thermal property
type: Class
subclass of: Property
comment: A subclass of the Property Class, ThermalProperty

spjump
type: Class
subclass of: Thermal property
comment: A subclass of the ThermalProperty Class, spjump. specific heat jump at Tc (delta-C)

gamma
type: Class
subclass of: Thermal property
comment: A subclass of the ThermalProperty Class, gamma. coefficient of electronic specific heat

debyet
type: Class
subclass of: Thermal property
comment: A subclass of the ThermalProperty Class, debyet. Debye temperature

thc300
type: Class
subclass of: Thermal property
comment: A subclass of the ThermalProperty Class, thc300. thermal conductivity at 300 K

thc300n
type: Class
subclass of: Thermal property
comment: A subclass of the ThermalProperty Class, thc300n. thermal conductivity at 300 K for heat flow//c-axis

thc300p
type: Class
subclass of: Thermal property
comment: A subclass of the ThermalProperty Class, thc300p. thermal conductivity at 300 K for heat flow//ab-plane

tp300
type: Class
subclass of: Thermal property
comment: A subclass of the ThermalProperty Class, tp300. thermopower at 300 K

tp300n
type: Class
subclass of: Thermal property
comment: A subclass of the ThermalProperty Class, tp300n. thermopower at 300 K for normal to ab-plane

tp300p
type: Class
subclass of: Thermal property
comment: A subclass of the ThermalProperty Class, tp300p. thermopower at 300 K for parallel to ab-plane

Normal state property
type: Class
subclass of: Property
comment: A subclass of the Property Class, NormalStateProperty

reshe
type: Class
subclass of: Normal state property
comment: A subclass of the NormalStateProperty Class, reshe. resistivity at 4.2 K for poly crystal

abreshe
type: Class
subclass of: Normal state property
comment: A subclass of the NormalStateProperty Class, abreshe. resistivity at 4.2 K for single crystal for J//ab-plane

creshe
type: Class
subclass of: Normal state property
comment: A subclass of the NormalStateProperty Class, creshe. resistivity at 4.2 K for single crystal for J//c-axis

res77
type: Class
subclass of: Normal state property
comment: A subclass of the NormalStateProperty Class, res77. resistivity at 77 K for poly crystal

abres77
type: Class
subclass of: Normal state property
comment: A subclass of the NormalStateProperty Class, abres77. resistivity at 77 K for single crystal for J//ab-plane

cres77
type: Class
subclass of: Normal state property
comment: A subclass of the NormalStateProperty Class, cres77. resistivity at 77 K for single crystal for J//c-axis

resn
type: Class
subclass of: Normal state property
comment: A subclass of the NormalStateProperty Class, resn. resistivity at normal-T for poly crystal

abresn
type: Class
subclass of: Normal state property
comment: A subclass of the NormalStateProperty Class, abresn. resistivity at normal-T for single crystal for J//ab-plane

cresn
type: Class
subclass of: Normal state property
comment: A subclass of the NormalStateProperty Class, cresn. resistivity at normal-T for single crystal for J//c-axis

resrt
type: Class
subclass of: Normal state property
comment: A subclass of the NormalStateProperty Class, resrt. resistivity at RT for poly crystal

abresrt
type: Class
subclass of: Normal state property
comment: A subclass of the NormalStateProperty Class, abresrt. resistivity at RT for single crystal for J//ab-plane

cresrt
type: Class
subclass of: Normal state property
comment: A subclass of the NormalStateProperty Class, cresrt. resistivity at RT for single crystal for J//c-axis

rh300
type: Class
subclass of: Normal state property
comment: A subclass of the NormalStateProperty Class, rh300. Hall coefficient at 300 K

rh300n
type: Class
subclass of: Normal state property
comment: A subclass of the NormalStateProperty Class, rh300n. Hall coefficient at 300 K for single, H//c-axis

rh300p
type: Class
subclass of: Normal state property
comment: A subclass of the NormalStateProperty Class, rh300p. Hall coefficient at 300 K for single, H//ab-plane

rhn
type: Class
subclass of: Normal state property
comment: A subclass of the NormalStateProperty Class, rhn. Hall coefficient for single, H//c-axis

field
type: Class
subclass of: Normal state property
comment: A subclass of the NormalStateProperty Class, field. magnetic field for Hall effect
subclass of: MagneticField
comment: A subclass of the MagneticField Class, field. magnetic field for Hall effect.

carrier
type: Class
subclass of: Normal state property
comment: A subclass of the NormalStateProperty Class, carrier. carrier density at 300 K

Specimen
type: Class
subclass of: BFO_0000040
comment: Specimen refers to real materials dealt with in SuperCon.

Organic
type: Class
subclass of: Specimen
comment: A subclass of the Specimen Class, Organic

OxideAndMetallic
type: Class
subclass of: Specimen
comment: A subclass of the Specimen Class, OxideAndMetallic. represents all chemicals dealt in SuperCon, Oxide & Metallic.

rawmat
type: Class
subclass of: OxideAndMetallic
comment: A subclass of the OxideAndMetallic Class, rawmat. raw materials

subst
type: Class
subclass of: OxideAndMetallic
comment: A subclass of the OxideAndMetallic Class, subst

target
type: Class
subclass of: OxideAndMetallic
comment: A subclass of the OxideAndMetallic Class, target

sample
type: Class
subclass of: OxideAndMetallic
comment: A subclass of the OxideAndMetallic Class, sample

isoel
type: Class
subclass of: Specimen
comment: A subclass of the Specimen Class, isoel. isotope element

Role
type: Class
subclass of: BFO_0000023
subclass of: Restriction
  on property: RO_0000081
  some values from: BFO_0000004
comment: Role refers to roles dealt with in SuperCon.

SampleProcessRole
type: Class
subclass of: Role
comment: A subclass of the Role Class, SampleProcessRole

ProductRole
type: Class
subclass of: SampleProcessRole
comment: A subclass of the SampleProcessRole Class, ProductRole

SamplePreparationRole
type: Class
subclass of: SampleProcessRole
comment: A subclass of the SampleProcess Class, SamplePreparationRole

rawmatRole
type: Class
subclass of: SamplePreparationRole
comment: A subclass of the SamplePreparationRole Class, rawmatRole. The role of Raw material.

substRole
type: Class
subclass of: SamplePreparationRole
comment: A subclass of the SamplePreparationRole Class, substRole. The role of Substrate.

targetRole
type: Class
subclass of: SamplePreparationRole
comment: A subclass of the SamplePreparationRole Class, targetRole. The role of Target.

IsotopeRole
type: Class
subclass of: Role
comment: A subclass of the Role Class, IsotopeRole

MixtureRole
type: Class
subclass of: Role
comment: A subclass of the Role Class, MixtureRole

Component
type: Class
subclass of: MixtureRole
comment: A subclass of the MixtureRole Class, Component

ma1
type: Class
subclass of: Component
comment: A subclass of the Component Class, ma1. first component roll

mb1
type: Class
subclass of: Component
comment: A subclass of the Component Class, mb1. second component roll

mc1
type: Class
subclass of: Component
comment: A subclass of the Component Class, mc1. third component roll

md1
type: Class
subclass of: Component
comment: A subclass of the Component Class, md1. forth component roll

me1
type: Class
subclass of: Component
comment: A subclass of the Component Class, me1. fifth component roll

mf1
type: Class
subclass of: Component
comment: A subclass of the Component Class, mf1. sixth component roll

mg1
type: Class
subclass of: Component
comment: A subclass of the Component Class, mg1. seventh component roll

mh1
type: Class
subclass of: Component
comment: A subclass of the Component Class, mh1. eighth component roll

mi1
type: Class
subclass of: Component
comment: A subclass of the Component Class, mi1. nineth component roll

mj1
type: Class
subclass of: Component
comment: A subclass of the Component Class, mj1. tenth component roll

mo1
type: Class
subclass of: Component
comment: A subclass of the Component Class, mo1. component rolls with oxygen

Unit
type: Class
subclass of: IAO_0000003

Magnetic property unit
type: Class
subclass of: Unit

ukai
type: Class
subclass of: Magnetic property unit
comment: A subclass of the MagneticPropertyUnit Class, ukai. unit of KAIZERO

ucc
type: Class
subclass of: Magnetic property unit
comment: A subclass of the MagneticPropertyUnit Class, ucc. unit of CURIEC

umoment
type: Class
subclass of: Magnetic property unit
comment: A subclass of the MagneticPropertyUnit Class, umoment. unit of MOMENT

Mechanical property unit
type: Class
subclass of: Unit

Udens
type: Class
subclass of: Mechanical property unit
comment: A subclass of the MechanicalPropertyUnit Class, Udens. Unit of density

uhv
type: Class
subclass of: Mechanical property unit
comment: A subclass of the MechanicalPropertyUnit Class, uhv. unit of hardness

uye
type: Class
subclass of: Mechanical property unit
comment: A subclass of the MechanicalPropertyUnit Class, uye. unit of Young's modulus

ug
type: Class
subclass of: Mechanical property unit
comment: A subclass of the MechanicalPropertyUnit Class, ug. unit of shear modulus

ub
type: Class
subclass of: Mechanical property unit
comment: A subclass of the MechanicalPropertyUnit Class, ub. unit of bulk modulus

usv
type: Class
subclass of: Mechanical property unit
comment: A subclass of the MechanicalPropertyUnit Class, usv. unit of sound velocity

Structural property unit
type: Class
subclass of: Unit

ulat
type: Class
subclass of: Structural property unit
comment: A subclass of the StructuralPropertyUnit Class, ulat. unit of lattice constant

udldt
type: Class
subclass of: Structural property unit
comment: A subclass of the StructuralPropertyUnit Class, udldt. unit of D(L)DT

udldp
type: Class
subclass of: Structural property unit
comment: A subclass of the StructuralPropertyUnit Class, udldp. unit of D(L)DP

SuperConducting property unit
type: Class
subclass of: Unit

utc
type: Class
subclass of: SuperConducting property unit
comment: A subclass of the SuperConductingPropertyUnit Class, utc. unit of Tc

udtcdp
type: Class
subclass of: SuperConducting property unit
comment: A subclass of the SuperConductingPropertyUnit Class, udtcdp. unit of DTCDP

uhc1
type: Class
subclass of: SuperConducting property unit
comment: A subclass of the SuperConductingPropertyUnit Class, uhc1. unit of Hc1

uhc2
type: Class
subclass of: SuperConducting property unit
comment: A subclass of the SuperConductingPropertyUnit Class, uhc2. unit of Hc2

udhc2dt
type: Class
subclass of: SuperConducting property unit
comment: A subclass of the SuperConductingPropertyUnit Class, udhc2dt. unit of dHc2/dT

ucohere
type: Class
subclass of: SuperConducting property unit
comment: A subclass of the SuperConductingPropertyUnit Class, ucohere. unit of COHERE

upenet
type: Class
subclass of: SuperConducting property unit
comment: A subclass of the SuperConductingPropertyUnit Class, upenet. unit of PENET

ugap
type: Class
subclass of: SuperConducting property unit
comment: A subclass of the SuperConductingPropertyUnit Class, ugap. unit of energy gap

Thermal property unit
type: Class
subclass of: Unit

ujump
type: Class
subclass of: Thermal property unit
comment: A subclass of the ThermalPropertyUnit Class, ujump. unit of SPJUMP

ugamma
type: Class
subclass of: Thermal property unit
comment: A subclass of the ThermalPropertyUnit Class, ugamma. unit of GAMMA

uthc
type: Class
subclass of: Thermal property unit
comment: A subclass of the ThermalPropertyUnit Class, uthc. unit of thermal conductivity

utp
type: Class
subclass of: Thermal property unit
comment: A subclass of the ThermalPropertyUnit Class, utp. unit of thermopower

Normal state property unit
type: Class
subclass of: Unit

ures
type: Class
subclass of: Normal state property unit
comment: A subclass of the NormalStatePropertyUnit Class, ures. unit of resistivity

uhall
type: Class
subclass of: Normal state property unit
comment: A subclass of the NormalStatePropertyUnit Class, uhall. unit of RH300

ucarr
type: Class
subclass of: Normal state property unit
comment: A subclass of the NormalStatePropertyUnit Class, ucarr. unit of carrier density

Descriptor
type: Class
subclass of: IAO_0000027
comment: Descriptor refers to descriptors for concepts on SuperCon.

Geometric Descriptor
type: Class
subclass of: Descriptor
comment: A subclass of the Descriptor Class, GeometricDescriptor. Descriptors for geometrical features, such as shape

shape
type: Class
subclass of: Geometric Descriptor
comment: A subclass of the GeometricDescriptor Class, shape

Isotope Descriptor
type: Class
subclass of: Descriptor
comment: A subclass of the Descriptor Class, IsotopeDescriptor. A descriptor that represents isotope-specific characteristics rather than chemical properties.

isorat
type: Class
subclass of: Isotope Descriptor
comment: A subclass of the IsotopeDescriptor Class, isorat. exchange ratio of isotope(%)

Material Structure Descriptor
type: Class
subclass of: Descriptor
comment: A subclass of the Descriptor Class, MaterialStructureDescriptor. Descriptors for chemical and crystallographic structural features.

str1
type: Class
subclass of: CrystalState
comment: A subclass of the CrystalState Class, str1. crystal structure, symmetry

cubic
type: Class
equivalent class: Class
  one of: cubic
subclass of: str1
type: NamedIndividual
comment: one of the str1, str1_01. cubic

tetragonal
type: Class
equivalent class: Class
  one of: tetragonal
subclass of: str1
type: NamedIndividual
comment: one of the str1, str1_02. tetragonal

orthorhombic
type: Class
equivalent class: Class
  one of: orthorhombic
subclass of: str1
type: NamedIndividual
comment: one of the str1, str1_03. orthorhombic

monoclinic
type: Class
equivalent class: Class
  one of: monoclinic
subclass of: str1
type: NamedIndividual
comment: one of the str1, str1_04. monoclinic

triclinic
type: Class
equivalent class: Class
  one of: triclinic
subclass of: str1
type: NamedIndividual
comment: one of the str1, str1_05. triclinic

trigonal
type: Class
equivalent class: Class
  one of: trigonal
subclass of: str1
type: NamedIndividual
comment: one of the str1, str1_06. trigonal (rhombohedral)

hexagonal
type: Class
equivalent class: Class
  one of: hexagonal
subclass of: str1
type: NamedIndividual
comment: one of the str1, str1_07. hexagonal

str3
type: Class
subclass of: CrystalState
comment: A subclass of the CrystalState Class, str3. common name of structure

spaceg
type: Class
subclass of: str1
comment: A subclass of the str1 Class, spaceg. space group

tblno
type: Class
subclass of: str1
comment: A subclass of the str1 Class, tblno. international table number

element
type: Class
subclass of: Material Structure Descriptor
comment: A subclass of the MaterialStructureDescriptor Class, element. chemical formula

name
type: Class
subclass of: Material Structure Descriptor
comment: A subclass of the MaterialStructureDescriptor Class, name. common formula of materials

ElementComposition
type: Class
subclass of: Material Structure Descriptor
comment: A subclass of the MaterialStructureDescriptor Class, ElementComposition

ma2
type: Class
subclass of: ElementComposition
comment: A subclass of the ElementComposition Class, ma2. composition of first component roll

mb2
type: Class
subclass of: ElementComposition
comment: A subclass of the ElementComposition Class, mb2. composition of second component roll

mc2
type: Class
subclass of: ElementComposition
comment: A subclass of the ElementComposition Class, mc2. composition of third component roll

md2
type: Class
subclass of: ElementComposition
comment: A subclass of the ElementComposition Class, md2. composition of forth component roll

me2
type: Class
subclass of: ElementComposition
comment: A subclass of the ElementComposition Class, me2. composition of fifth component roll e

mf2
type: Class
subclass of: ElementComposition
comment: A subclass of the ElementComposition Class, mf2. composition of sixth component roll

mg2
type: Class
subclass of: ElementComposition
comment: A subclass of the ElementComposition Class, mg2. composition of seventh component roll

mh2
type: Class
subclass of: ElementComposition
comment: A subclass of the ElementComposition Class, mh2. composition of eighth component roll

mi2
type: Class
subclass of: ElementComposition
comment: A subclass of the ElementComposition Class, mi2. composition of nineth component roll

mj2
type: Class
subclass of: ElementComposition
comment: A subclass of the ElementComposition Class, mj2. composition of tenth component roll

mo2
type: Class
subclass of: ElementComposition
comment: A subclass of the ElementComposition Class, mo2. composition of O in common formula

CrystalOrientation
type: Class
subclass of: Material Structure Descriptor
comment: A subclass of the MaterialStructureDescriptor Class, CrystalOrientation

Physical Descriptor
type: Class
subclass of: Descriptor
comment: A subclass of the Descriptor Class, PhysicalDescriptor. Descriptors that represent features with basic physical properties.

Pressure
type: Class
subclass of: Physical Descriptor
comment: A subclass of the PhysicalDescriptor Class, Pressure

Temperature
type: Class
subclass of: Physical Descriptor
comment: A subclass of the PhysicalDescriptor Class, Temperature

tempc1
type: Class
subclass of: Temperature
comment: A subclass of the Temperature Class, tempc1. measuring temperature for hc1t, phc1t, and nhc1t

tempc2
type: Class
subclass of: Temperature
comment: A subclass of the Temperature Class, tempc2. measuring temperature for hc2t, phc2t, and nhc2t

nort
type: Class
subclass of: Temperature
comment: A subclass of the Temperature Class, nort. normal temperature

MagneticField
type: Class
subclass of: Physical Descriptor
comment: A subclass of the PhysicalDescriptor Class, MagneticField. Magnetic field, H

ElectricField
type: Class
subclass of: Physical Descriptor
comment: A subclass of the PhysicalDescriptor Class, ElectricField E

Current
type: Class
subclass of: ElectricField
comment: A subclass of the ElectricField Class, Current J

Struture
type: Class
subclass of: IAO_0000030
comment: Struture refers to the internal structure of a substance, identified based on its chemical structure, etc.

InternalStructure
type: Class
subclass of: Struture
comment: A subclass of the Struture Class, InternalStructure

MeasurementMethod
type: Class
subclass of: IAO_0000104
comment: MeasurementMethod refers to a measurement method as a plan specification.

analm
type: Class
subclass of: MeasurementMethod
comment: A subclass of the MeasurementMethod Class, analm. method of analysis for structure

X-ray crystallography
type: Class
subclass of: analm
comment: A subclass of the analm Class, analm_01

Neutron crystallography
type: Class
subclass of: analm
comment: A subclass of the analm Class, analm_02

Powder x-ray diffraction
type: Class
subclass of: analm
comment: A subclass of the analm Class, analm_03

Powder neutron diffraction
type: Class
subclass of: analm
comment: A subclass of the analm Class, analm_04

Electron diffraction
type: Class
subclass of: analm
comment: A subclass of the analm Class, analm_05

Unknown analm 7
type: Class
subclass of: analm
comment: A subclass of the analm Class, analm_07

tcmeth
type: Class
subclass of: MeasurementMethod
comment: A subclass of the MeasurementMethod Class, tcmeth. tc measurement method

mhc1
type: Class
subclass of: MeasurementMethod
comment: A subclass of the MeasurementMethod Class, mhc1. method of Hc1 derivation

mhc2
type: Class
subclass of: MeasurementMethod
comment: A subclass of the MeasurementMethod Class, mhc2. method of Hc2 derivation

mdhc2dt
type: Class
subclass of: MeasurementMethod
comment: A subclass of the MeasurementMethod Class, mdhc2dt. method of dHc2/dT derivation

mhirr
type: Class
subclass of: MeasurementMethod
comment: A subclass of the MeasurementMethod Class, mhirr. difinition or method for Hirr

mcohere
type: Class
subclass of: MeasurementMethod
comment: A subclass of the MeasurementMethod Class, mcohere. method of COHERE derivation

mpenet
type: Class
subclass of: MeasurementMethod
comment: A subclass of the MeasurementMethod Class, mpenet. method of PENET derivation

gapmeth
type: Class
subclass of: MeasurementMethod
comment: A subclass of the MeasurementMethod Class, gapmeth. method of measuring energy gap

mdebye
type: Class
subclass of: MeasurementMethod
comment: A subclass of the MeasurementMethod Class, mdebye. method for derivation of Debye temperature

PreparationMethod
type: Class
subclass of: IAO_0000104
comment: PreparationMethod refers to a preparation method as a plan specification.

method
type: Class
subclass of: PreparationMethod
comment: A subclass of the PreparationMethod Class, method. preparation method

f_prep
type: Class
subclass of: PreparationMethod
comment: A subclass of the PreparationMethod Class, f_prep. preparation method for film

FigureNumber
type: Class
subclass of: IAO_0000300
comment: FigureNumber refers to the figure numbers contained in SuperCon.

svfig
type: Class
subclass of: FigureNumber
comment: A subclass of the FigureNumber Class, svfig. figure number for SV(T)

model
type: Class
subclass of: FigureNumber
comment: A subclass of the FigureNumber Class, model. figure number of structure model

tcfig
type: Class
subclass of: FigureNumber
comment: A subclass of the FigureNumber Class, tcfig. figure number for Tc(p, x, etc)

hirfig
type: Class
subclass of: FigureNumber
comment: A subclass of the FigureNumber Class, hirfig. figure number for Hirr(T), irreversibility field

figjc
type: Class
subclass of: FigureNumber
comment: A subclass of the FigureNumber Class, figjc. figure number for Jc(T,H)

spheat
type: Class
subclass of: FigureNumber
comment: A subclass of the FigureNumber Class, spheat. graph number of specific heat

thcfig
type: Class
subclass of: FigureNumber
comment: A subclass of the FigureNumber Class, thcfig. graph number for thermal conductivity

tpfig
type: Class
subclass of: FigureNumber
comment: A subclass of the FigureNumber Class, tpfig. graph number for thermopower

hallfig
type: Class
subclass of: FigureNumber
comment: A subclass of the FigureNumber Class, hallfig. graph number for Hall coefficient

institute
type: Class
subclass of: IAO_0000303
comment: institute refers to the institution where the study was conducted.

Measurement
type: Class
subclass of: OBI_0000011
comment: Measurement refers to measurement as a planned process.

CrystallographicMeasurement
type: Class
subclass of: Measurement
comment: A subclass of the Measurement Class, CrystallographicMeasurement

SampleProcess
type: Class
subclass of: OBI_0000011
comment: SampleProcess refers to Processes for samples dealt with in SuperCon.

SamplePreparation
type: Class
subclass of: SampleProcess
comment: A subclass of the SampleProcess Class, SamplePreparation.

PreparationForFilm
type: Class
subclass of: SampleProcess
comment: A subclass of the SampleProcess Class, PreparationForFilm. Preparation for film

single phase (bulk)
type: NamedIndividual
type: shape
comment: An instance of the shape Class, shape_01

multi phase (bulk)
type: NamedIndividual
type: shape
comment: An instance of the shape Class, shape_02

single crystal (bulk)
type: NamedIndividual
type: shape
comment: An instance of the shape Class, shape_03

film
type: NamedIndividual
type: shape
comment: An instance of the shape Class, shape_04

film (single)
type: NamedIndividual
type: shape
comment: An instance of the shape Class, shape_05

unknown shape 6
type: NamedIndividual
type: shape
comment: An instance of the shape Class, shape_06

unknown shape 8
type: NamedIndividual
type: shape
comment: An instance of the shape Class, shape_08

unknown shape 9
type: NamedIndividual
type: shape
comment: An instance of the shape Class, shape_09

unknown shape 12
type: NamedIndividual
type: shape
comment: An instance of the shape Class, shape_12

powder sintering method
type: NamedIndividual
type: method
type: f_prep
comment: An instance of the method and f_prep Classes, method_01

doctor blade method
type: NamedIndividual
type: method
type: f_prep
comment: An instance of the method and f_prep Classes, method_02

screen printing metod
type: NamedIndividual
type: method
type: f_prep
comment: An instance of the method and f_prep Classes, method_03

extrusion method
type: NamedIndividual
type: method
type: f_prep
comment: An instance of the method and f_prep Classes, method_04

flux method
type: NamedIndividual
type: method
type: f_prep
comment: An instance of the method and f_prep Classes, method_05

Top Seeded Solution Growth method
type: NamedIndividual
type: method
type: f_prep
comment: An instance of the method and f_prep Classes, method_06

floating zone method
type: NamedIndividual
type: method
type: f_prep
comment: An instance of the method and f_prep Classes, method_07

Liquid Phase Epitaxy
type: NamedIndividual
type: method
type: f_prep
comment: An instance of the method and f_prep Classes, method_08

melt-quench method
type: NamedIndividual
type: method
type: f_prep
comment: An instance of the method and f_prep Classes, method_09

Bridgeman
type: NamedIndividual
type: method
type: f_prep
comment: An instance of the method and f_prep Classes, method_10

sol-gel method
type: NamedIndividual
type: method
type: f_prep
comment: An instance of the method and f_prep Classes, method_11

organic acid base method
type: NamedIndividual
type: method
type: f_prep
comment: An instance of the method and f_prep Classes, method_12

suspension method
type: NamedIndividual
type: method
type: f_prep
comment: An instance of the method and f_prep Classes, method_13

spray coating method
type: NamedIndividual
type: method
type: f_prep
comment: An instance of the method and f_prep Classes, method_14

plasma spray method
type: NamedIndividual
type: method
type: f_prep
comment: An instance of the method and f_prep Classes, method_15

sputter deposition
type: NamedIndividual
type: method
type: f_prep
comment: An instance of the method and f_prep Classes, method_16

vacuum deposition
type: NamedIndividual
type: method
type: f_prep
comment: An instance of the method and f_prep Classes, method_17

CVD method
type: NamedIndividual
type: method
type: f_prep
comment: An instance of the method and f_prep Classes, method_18

Metal-Organic Chemical Vapor Deposition
type: NamedIndividual
type: method
type: f_prep
comment: An instance of the method and f_prep Classes, method_19

Vapor Growth method
type: NamedIndividual
type: method
type: f_prep
comment: An instance of the method and f_prep Classes, method_20

Molecular Beam Epitaxy method
type: NamedIndividual
type: method
type: f_prep
comment: An instance of the method and f_prep Classes, method_21

magnetization
type: NamedIndividual
type: tcmeth
comment: An instance of the tcmeth Classes, tcmeth_01

ac susceptibility
type: NamedIndividual
type: tcmeth
comment: An instance of the tcmeth Classes, tcmeth_02

resistivity
type: NamedIndividual
type: tcmeth
comment: An instance of the tcmeth Classes, tcmeth_03

heat capacity
type: NamedIndividual
type: tcmeth
comment: An instance of the tcmeth Classes, tcmeth_04

tunneling
type: NamedIndividual
type: tcmeth
comment: An instance of the tcmeth Classes, tcmeth_05

infrared spectroscopy
type: NamedIndividual
type: tcmeth
comment: An instance of the tcmeth Classes, tcmeth_06

thermal conductivity
type: NamedIndividual
type: tcmeth
comment: An instance of the tcmeth Classes, tcmeth_07

Raman spectroscopy
type: NamedIndividual
type: tcmeth
comment: An instance of the tcmeth Classes, tcmeth_08

nuclear magnetic resonance
type: NamedIndividual
type: tcmeth
comment: An instance of the tcmeth Classes, tcmeth_09

surface impedance
type: NamedIndividual
type: tcmeth
comment: An instance of the tcmeth Classes, tcmeth_10

neutron diffraction
type: NamedIndividual
type: tcmeth
comment: An instance of the tcmeth Classes, tcmeth_11

photoemission spectroscopy
type: NamedIndividual
type: tcmeth
comment: An instance of the tcmeth Classes, tcmeth_12

microwave transmission
type: NamedIndividual
type: tcmeth
comment: An instance of the tcmeth Classes, tcmeth_13

Others
type: NamedIndividual
type: tcmeth
comment: An instance of the tcmeth Classes, tcmeth_14

tunneling
type: NamedIndividual
type: gapmeth
comment: An instance of the gapmeth Class, gapmeth_01

infrared spectroscopy
type: NamedIndividual
type: gapmeth
comment: An instance of the gapmeth Class, gapmeth_02

thermal conductivity
type: NamedIndividual
type: gapmeth
comment: An instance of the gapmeth Class, gapmeth_03

Raman spectroscopy
type: NamedIndividual
type: gapmeth
comment: An instance of the gapmeth Class, gapmeth_04

AC susceptibility
type: NamedIndividual
type: gapmeth
comment: An instance of the gapmeth Class, gapmeth_05

nuclear magnetic resonance
type: NamedIndividual
type: gapmeth
comment: An instance of the gapmeth Class, gapmeth_06

surface impedance
type: NamedIndividual
type: gapmeth
comment: An instance of the gapmeth Class, gapmeth_07

neutron diffraction
type: NamedIndividual
type: gapmeth
comment: An instance of the gapmeth Class, gapmeth_08

ultraviolet photoemission spectroscopy
type: NamedIndividual
type: gapmeth
comment: An instance of the gapmeth Class, gapmeth_09

microwave transmission
type: NamedIndividual
type: gapmeth
comment: An instance of the gapmeth Class, gapmeth_10

unknown gapmeth 11
type: NamedIndividual
type: gapmeth
comment: An instance of the gapmeth Class, gapmeth_11

unknown gapmeth 12
type: NamedIndividual
type: gapmeth
comment: An instance of the gapmeth Class, gapmeth_12

unknown gapmeth 13
type: NamedIndividual
type: gapmeth
comment: An instance of the gapmeth Class, gapmeth_13

unknown gapmeth 14
type: NamedIndividual
type: gapmeth
comment: An instance of the gapmeth Class, gapmeth_14

unknown gapmeth 15
type: NamedIndividual
type: gapmeth
comment: An instance of the gapmeth Class, gapmeth_15

unknown gapmeth 16
type: NamedIndividual
type: gapmeth
comment: An instance of the gapmeth Class, gapmeth_16

unknown gapmeth 17
type: NamedIndividual
type: gapmeth
comment: An instance of the gapmeth Class, gapmeth_17

h_0
type: NamedIndividual
type: MagneticField
comment: An instance of the MagneticField Class, h_0. h_0 indicates a zero magnetic field.

pres_0
type: NamedIndividual
type: Pressure
comment: An instance of the Pressure Class, pres_0. pres_0 indicates a non-pressurized state.

temp_300
type: NamedIndividual
type: Temperature
comment: An instance of the Temperature Class, temp_300. temp_300 indicates room temperature, roughly 300 K.

temp_77
type: NamedIndividual
type: Temperature
comment: An instance of the Temperature Class, temp_77. temp_77 refers to the liquid nitrogen temperature, roughly 77 K.

temp_He
type: NamedIndividual
type: Temperature
comment: An instance of the Temperature Class, temp_He. temp_He indicates the liquid helium temperature, roughly 4.2 K.

temp_0
type: NamedIndividual
type: Temperature
comment: An instance of the Temperature Class, temp_0. temp_0 indicates a virtual temperature of 0 K, known as absolute zero.

temp_0
type: NamedIndividual
type: Temperature
comment: An instance of the Temperature Class, temp_Tc. temp_Tc indicates the critical temperature at which the superconducting properties are observed.

ab_plane
type: NamedIndividual
type: CrystalOrientation
comment: An instance of the CrystalOrientation Class, ab_plane. ab-plane of a crystal.

c_axis
type: NamedIndividual
type: CrystalOrientation
comment: An instance of the CrystalOrientation Class, c_axis. c-axis of the crystal

tr0
type: NamedIndividual
type: Temperature
comment: An instance of the Temperature Class, tr0. Critical temperature for t1

tmid
type: NamedIndividual
type: Temperature
comment: An instance of the Temperature Class, tmid. Critical temperature for t2

tr100
type: NamedIndividual
type: Temperature
comment: An instance of the Temperature Class, tr100. Critical temperature for t3